Target
Polyadenylate-binding protein 1
Ligand
BDBM87693
Substrate
Meas. Tech.
Dose-response confirmation of microRNA-mediated mRNA deadenylation inhibitors by fluoresence polarization assay
IC50
>66000±n/a nM
Citation
 PubChem, PC Dose-response confirmation of microRNA-mediated mRNA deadenylation inhibitors by fluoresence polarization assay PubChem Bioassay (2012)[AID] 
Target
Name:
Polyadenylate-binding protein 1
Synonyms:
PAB1 PABP1 PABPC1 poly(A) binding protein, cytoplasmic 1 | polyadenylate-binding protein 1
Type:
Enzyme Catalytic Domain
Mol. Mass.:
70694.26
Organism:
Homo sapiens (Human)
Description:
gi_46367787
Residue:
636
  
Inhibitor
Name:
BDBM87693
Synonyms:
1-(4-mesylpiperazino)-2-phenyl-2-(phenylthio)ethanone 1-(4-methylsulfonylpiperazin-1-yl)-2-phenyl-2-phenylsulfanyl-ethanone 1-(methylsulfonyl)-4-[phenyl(phenylthio)acetyl]piperazine SMR000080435 | cid_2970745
Type:
Small organic molecule
Emp. Form.:
C19H22N2O3S2
Mol. Mass.:
390.52
SMILES:
CS(=O)(=O)N1CCN(CC1)C(=O)C(Sc1ccccc1)c1ccccc1
: