Target
Polyadenylate-binding protein 1
Ligand
BDBM87674
Substrate
Meas. Tech.
Dose-response secondary confirmation of microRNA-mediated mRNA deadenylation inhibitors by fluoresence polarization assay using Cy5 labeled peptide
IC50
>66000±n/a nM
Citation
 PubChem, PC Dose-response secondary confirmation of microRNA-mediated mRNA deadenylation inhibitors by fluoresence polarization assay using Cy5 labeled peptide PubChem Bioassay (2012)[AID] 
Target
Name:
Polyadenylate-binding protein 1
Synonyms:
PAB1 PABP1 PABPC1 poly(A) binding protein, cytoplasmic 1 | polyadenylate-binding protein 1
Type:
Enzyme Catalytic Domain
Mol. Mass.:
70694.26
Organism:
Homo sapiens (Human)
Description:
gi_46367787
Residue:
636
  
Inhibitor
Name:
BDBM87674
Synonyms:
2-[(2-keto-3,4-dihydro-1H-quinolin-6-yl)sulfonylamino]-N-(6-methyl-2-pyridyl)-2-phenyl-acetamide N-(6-methyl-2-pyridinyl)-2-[(2-oxo-3,4-dihydro-1H-quinolin-6-yl)sulfonylamino]-2-phenylacetamide N-(6-methylpyridin-2-yl)-2-[(2-oxo-3,4-dihydro-1H-quinolin-6-yl)sulfonylamino]-2-phenylacetamide SMR000028053 | cid_3244412
Type:
Small organic molecule
Emp. Form.:
C23H22N4O4S
Mol. Mass.:
450.51
SMILES:
Cc1cccc(NC(=O)C(NS(=O)(=O)c2ccc3NC(=O)CCc3c2)c2ccccc2)n1
: