Target
Melanocortin receptor 4
Ligand
BDBM52442
Substrate
Meas. Tech.
Luminescence-based cell-based high throughput dose response assay for biased ligands (agonists) of the melanocortin 4 receptor (MC4R)
EC50
>89176±n/a nM
Citation
 PubChem, PC Luminescence-based cell-based high throughput dose response assay for biased ligands (agonists) of the melanocortin 4 receptor (MC4R) PubChem Bioassay (2012)[AID] 
Target
Name:
Melanocortin receptor 4
Synonyms:
MC4-R MC4R_HUMAN Melanocortin receptor 4 (MC-4) Melanocortin receptor 4 (MC4R)
Type:
Enzyme
Mol. Mass.:
36949.50
Organism:
Homo sapiens (Human)
Description:
P32245
Residue:
332
  
Inhibitor
Name:
BDBM52442
Synonyms:
2-[2-[(3-amino-7-methyl-thieno[2,3-b]quinoline-2-carbonyl)amino]thiazol-4-yl]acetic acid ethyl ester MLS000564527 cid_3167478 ethyl 2-[2-[(3-azanyl-7-methyl-thieno[2,3-b]quinolin-2-yl)carbonylamino]-1,3-thiazol-4-yl]ethanoate | {2-[(3-Amino-7-methyl-thieno[2,3-b]quinoline-2-carbonyl)-amino]-thiazol-4-yl}-acetic acid ethyl ester
Type:
Small organic molecule
Emp. Form.:
C20H18N4O3S2
Mol. Mass.:
426.512
SMILES:
CCOC(=O)Cc1csc(NC(=O)c2sc3nc4cc(C)ccc4cc3c2N)n1
: