Target
Melanocortin receptor 4
Ligand
BDBM88499
Substrate
Meas. Tech.
Luminescence-based cell-based high throughput dose response assay for biased ligands (agonists) of the melanocortin 4 receptor (MC4R)
EC50
>89128±n/a nM
Citation
 PubChem, PC Luminescence-based cell-based high throughput dose response assay for biased ligands (agonists) of the melanocortin 4 receptor (MC4R) PubChem Bioassay (2012)[AID] 
Target
Name:
Melanocortin receptor 4
Synonyms:
MC4-R MC4R_HUMAN Melanocortin receptor 4 (MC-4) Melanocortin receptor 4 (MC4R)
Type:
Enzyme
Mol. Mass.:
36949.50
Organism:
Homo sapiens (Human)
Description:
P32245
Residue:
332
  
Inhibitor
Name:
BDBM88499
Synonyms:
KUC104001 N-octyl-2-(2-phenylethylamino)ethanesulfonamide SMR001788221 | cid_45479968
Type:
Small organic molecule
Emp. Form.:
C18H32N2O2S
Mol. Mass.:
340.524
SMILES:
CCCCCCCCNS(=O)(=O)CCNCCc1ccccc1
: