Target
Melanocortin receptor 4
Ligand
BDBM88608
Substrate
Meas. Tech.
TRFRET-based cell-based high throughput dose response assay for biased ligands (antagonists) of the melanocortin 4 receptor (MC4R)
IC50
>64592±n/a nM
Citation
 PubChem, PC TRFRET-based cell-based high throughput dose response assay for biased ligands (antagonists) of the melanocortin 4 receptor (MC4R) PubChem Bioassay (2012)[AID] 
Target
Name:
Melanocortin receptor 4
Synonyms:
MC4-R MC4R_HUMAN Melanocortin receptor 4 (MC-4) Melanocortin receptor 4 (MC4R)
Type:
Enzyme
Mol. Mass.:
36949.50
Organism:
Homo sapiens (Human)
Description:
P32245
Residue:
332
  
Inhibitor
Name:
BDBM88608
Synonyms:
9,10-diketoanthracene-1-carboxylic acid [2-(2,5-dimethylanilino)-2-keto-ethyl] ester MLS000390666 [2-(2,5-dimethylanilino)-2-oxoethyl] 9,10-dioxoanthracene-1-carboxylate cid_3503149
Type:
Small organic molecule
Emp. Form.:
C25H19NO5
Mol. Mass.:
413.4221
SMILES:
Cc1ccc(C)c(NC(=O)COC(=O)c2cccc3C(=O)c4ccccc4C(=O)c23)c1
: