Target
Melanocortin receptor 4
Ligand
BDBM54813
Substrate
Meas. Tech.
TRFRET-based cell-based high throughput dose response assay for biased ligands (antagonists) of the melanocortin 4 receptor (MC4R)
IC50
11907±n/a nM
Citation
 PubChem, PC TRFRET-based cell-based high throughput dose response assay for biased ligands (antagonists) of the melanocortin 4 receptor (MC4R) PubChem Bioassay (2012)[AID] 
Target
Name:
Melanocortin receptor 4
Synonyms:
MC4-R MC4R_HUMAN Melanocortin receptor 4 (MC-4) Melanocortin receptor 4 (MC4R)
Type:
Enzyme
Mol. Mass.:
36949.50
Organism:
Homo sapiens (Human)
Description:
P32245
Residue:
332
  
Inhibitor
Name:
BDBM54813
Synonyms:
5-(2,5-dioxo-1-pyrrolyl)-N-(4-methylphenyl)-2-(4-morpholinyl)benzamide 5-[2,5-bis(oxidanylidene)pyrrol-1-yl]-N-(4-methylphenyl)-2-morpholin-4-yl-benzamide MLS000708115 cid_1080132
Type:
Small organic molecule
Emp. Form.:
C22H21N3O4
Mol. Mass.:
391.4198
SMILES:
Cc1ccc(NC(=O)c2cc(ccc2N2CCOCC2)N2C(=O)C=CC2=O)cc1
: