Target
Melanocortin receptor 4
Ligand
BDBM53969
Substrate
Meas. Tech.
TRFRET-based cell-based high throughput dose response assay for biased ligands (antagonists) of the melanocortin 4 receptor (MC4R)
IC50
>64580±n/a nM
Citation
 PubChem, PC TRFRET-based cell-based high throughput dose response assay for biased ligands (antagonists) of the melanocortin 4 receptor (MC4R) PubChem Bioassay (2012)[AID] 
Target
Name:
Melanocortin receptor 4
Synonyms:
MC4-R MC4R_HUMAN Melanocortin receptor 4 (MC-4) Melanocortin receptor 4 (MC4R)
Type:
Enzyme
Mol. Mass.:
36949.50
Organism:
Homo sapiens (Human)
Description:
P32245
Residue:
332
  
Inhibitor
Name:
BDBM53969
Synonyms:
2-[(5-cyano-4-keto-6-phenyl-1H-pyrimidin-2-yl)thio]-N-(6-ethoxy-1,3-benzothiazol-2-yl)acetamide 2-[(5-cyano-4-oxo-6-phenyl-1H-pyrimidin-2-yl)sulfanyl]-N-(6-ethoxy-1,3-benzothiazol-2-yl)acetamide 2-[(5-cyano-6-oxo-4-phenyl-1,6-dihydro-2-pyrimidinyl)thio]-N-(6-ethoxy-1,3-benzothiazol-2-yl)acetamide SMR000300813 | cid_2227940
Type:
Small organic molecule
Emp. Form.:
C22H17N5O3S2
Mol. Mass.:
463.532
SMILES:
CCOc1ccc2nc(NC(=O)CSc3nc(-c4ccccc4)c(C#N)c(=O)[nH]3)sc2c1
: