Target
Lethal factor
Ligand
BDBM88698
Substrate
Meas. Tech.
High-throughput multiplex microsphere dose response for inhibitors of toxin protease, specifically Lethal Factor protease, compounds from Cherry Pick 02
EC50
>20000±n/a nM
Citation
 PubChem, PC High-throughput multiplex microsphere dose response for inhibitors of toxin protease, specifically Lethal Factor protease, compounds from Cherry Pick 02 PubChem Bioassay (2012)[AID] 
Target
Name:
Lethal factor
Synonyms:
Anthrax Lethal Factor (LF) Antrax lethal toxin lef | lethal factor
Type:
PROTEIN
Mol. Mass.:
93758.56
Organism:
Bacillus anthracis
Description:
ChEMBL_1460338
Residue:
809
  
Inhibitor
Name:
BDBM88698
Synonyms:
2-hydroxy-3-methoxy-benzoic acid [2-(1H-indol-3-yl)-2-keto-ethyl] ester MLS000774580 [2-(1H-indol-3-yl)-2-oxidanylidene-ethyl] 3-methoxy-2-oxidanyl-benzoate cid_2413462
Type:
Small organic molecule
Emp. Form.:
C18H15NO5
Mol. Mass.:
325.3154
SMILES:
COc1cccc(C(=O)OCC(=O)c2c[nH]c3ccccc23)c1O
: