Target
Tyrosine-protein phosphatase non-receptor type 11
Ligand
BDBM88718
Substrate
Meas. Tech.
Dose Response selectivity of inhibitors of Striatal-Enriched Phosphatase (STEP) in a SHP2 (PTPN11) Inhibition Assay
IC50
4300±n/a nM
Citation
 PubChem, PC Dose Response selectivity of inhibitors of Striatal-Enriched Phosphatase (STEP) in a SHP2 (PTPN11) Inhibition Assay PubChem Bioassay (2012)[AID] 
Target
Name:
Tyrosine-protein phosphatase non-receptor type 11
Synonyms:
PTN11_HUMAN PTP-2C PTPN11 Protein tyrosine phosphatase (PTP) Shp2 Protein-tyrosine phosphatase 2C SHP2 Src homology phosphatase 2 (SHP-2) Tyrosine-protein phosphatase non-receptor type 11 (PTPN11) Tyrosine-protein phosphatase non-receptor type 11 (SHP2)
Type:
Protein phosphatase
Mol. Mass.:
68443.59
Organism:
Homo sapiens (Human)
Description:
Q06124
Residue:
597
  
Inhibitor
Name:
BDBM88718
Synonyms:
2-(carbomethoxyamino)-5-(diethylcarbamoyl)-4-methyl-thiophene-3-carboxylic acid ethyl ester MLS000109993 cid_874190 ethyl 5-(diethylcarbamoyl)-2-(methoxycarbonylamino)-4-methylthiophene-3-carboxylate
Type:
Small organic molecule
Emp. Form.:
C15H22N2O5S
Mol. Mass.:
342.411
SMILES:
CCOC(=O)c1c(C)c(sc1NC(=O)OC)C(=O)N(CC)CC
: