Target
Tyrosine-protein phosphatase non-receptor type 11
Ligand
BDBM88728
Substrate
Meas. Tech.
Dose Response selectivity of inhibitors of Striatal-Enriched Phosphatase (STEP) in a SHP2 (PTPN11) Inhibition Assay
IC50
5900±n/a nM
Citation
 PubChem, PC Dose Response selectivity of inhibitors of Striatal-Enriched Phosphatase (STEP) in a SHP2 (PTPN11) Inhibition Assay PubChem Bioassay (2012)[AID] 
Target
Name:
Tyrosine-protein phosphatase non-receptor type 11
Synonyms:
PTN11_HUMAN PTP-2C PTPN11 Protein tyrosine phosphatase (PTP) Shp2 Protein-tyrosine phosphatase 2C SHP2 Src homology phosphatase 2 (SHP-2) Tyrosine-protein phosphatase non-receptor type 11 (PTPN11) Tyrosine-protein phosphatase non-receptor type 11 (SHP2)
Type:
Protein phosphatase
Mol. Mass.:
68443.59
Organism:
Homo sapiens (Human)
Description:
Q06124
Residue:
597
  
Inhibitor
Name:
BDBM88728
Synonyms:
1-naphthalenecarboxylic acid [(Z)-[amino-(3-nitrophenyl)methylidene]amino] ester N'-(1-naphthoyloxy)-3-nitrobenzenecarboximidamide [(Z)-[amino-(3-nitrophenyl)methylidene]amino] naphthalene-1-carboxylate cid_5338769 | naphthalene-1-carboxylic acid [(Z)-[amino-(3-nitrophenyl)methylene]amino] ester
Type:
Small organic molecule
Emp. Form.:
C18H13N3O4
Mol. Mass.:
335.3135
SMILES:
[O-][N+](=O)c1cccc(c1)C(=[NH2+])[N-]OC(=O)c1cccc2ccccc12
: