Target
Tyrosine-protein phosphatase non-receptor type 11
Ligand
BDBM88764
Substrate
Meas. Tech.
Dose Response selectivity of inhibitors of Striatal-Enriched Phosphatase (STEP) in a SHP2 (PTPN11) Inhibition Assay
IC50
1890±n/a nM
Citation
 PubChem, PC Dose Response selectivity of inhibitors of Striatal-Enriched Phosphatase (STEP) in a SHP2 (PTPN11) Inhibition Assay PubChem Bioassay (2012)[AID] 
Target
Name:
Tyrosine-protein phosphatase non-receptor type 11
Synonyms:
PTN11_HUMAN PTP-2C PTPN11 Protein tyrosine phosphatase (PTP) Shp2 Protein-tyrosine phosphatase 2C SHP2 Src homology phosphatase 2 (SHP-2) Tyrosine-protein phosphatase non-receptor type 11 (PTPN11) Tyrosine-protein phosphatase non-receptor type 11 (SHP2)
Type:
Protein phosphatase
Mol. Mass.:
68443.59
Organism:
Homo sapiens (Human)
Description:
Q06124
Residue:
597
  
Inhibitor
Name:
BDBM88764
Synonyms:
1-(3-chloranyl-4-methoxy-phenyl)-3-(3-pyrrolidin-1-ylpropyl)thiourea 1-(3-chloro-4-methoxyphenyl)-3-(3-pyrrolidin-1-ylpropyl)thiourea MLS000730543 SMR000308819 | cid_16193058
Type:
Small organic molecule
Emp. Form.:
C15H22ClN3OS
Mol. Mass.:
327.873
SMILES:
COc1ccc(NC(=S)NCCCN2CCCC2)cc1Cl
: