Target
Tyrosine-protein phosphatase non-receptor type 11
Ligand
BDBM88786
Substrate
Meas. Tech.
Dose Response selectivity of inhibitors of Striatal-Enriched Phosphatase (STEP) in a SHP2 (PTPN11) Inhibition Assay
IC50
2380±n/a nM
Citation
 PubChem, PC Dose Response selectivity of inhibitors of Striatal-Enriched Phosphatase (STEP) in a SHP2 (PTPN11) Inhibition Assay PubChem Bioassay (2012)[AID] 
Target
Name:
Tyrosine-protein phosphatase non-receptor type 11
Synonyms:
PTN11_HUMAN PTP-2C PTPN11 Protein tyrosine phosphatase (PTP) Shp2 Protein-tyrosine phosphatase 2C SHP2 Src homology phosphatase 2 (SHP-2) Tyrosine-protein phosphatase non-receptor type 11 (PTPN11) Tyrosine-protein phosphatase non-receptor type 11 (SHP2)
Type:
Protein phosphatase
Mol. Mass.:
68443.59
Organism:
Homo sapiens (Human)
Description:
Q06124
Residue:
597
  
Inhibitor
Name:
BDBM88786
Synonyms:
2-[[[4-cyano-5-[(E)-2-(dimethylamino)ethenyl]-3-isothiazolyl]thio]methyl]benzoic acid methyl ester MLS001165510 cid_6079403 methyl 2-[[4-cyano-5-[(E)-2-(dimethylamino)ethenyl]-1,2-thiazol-3-yl]sulfanylmethyl]benzoate
Type:
Small organic molecule
Emp. Form.:
C17H17N3O2S2
Mol. Mass.:
359.466
SMILES:
COC(=O)c1ccccc1CSc1nsc(\C=C\N(C)C)c1C#N
: