Target
Tyrosine-protein phosphatase non-receptor type 11
Ligand
BDBM88800
Substrate
Meas. Tech.
Dose Response selectivity of inhibitors of Striatal-Enriched Phosphatase (STEP) in a SHP2 (PTPN11) Inhibition Assay
IC50
526±n/a nM
Citation
 PubChem, PC Dose Response selectivity of inhibitors of Striatal-Enriched Phosphatase (STEP) in a SHP2 (PTPN11) Inhibition Assay PubChem Bioassay (2012)[AID] 
Target
Name:
Tyrosine-protein phosphatase non-receptor type 11
Synonyms:
PTN11_HUMAN PTP-2C PTPN11 Protein tyrosine phosphatase (PTP) Shp2 Protein-tyrosine phosphatase 2C SHP2 Src homology phosphatase 2 (SHP-2) Tyrosine-protein phosphatase non-receptor type 11 (PTPN11) Tyrosine-protein phosphatase non-receptor type 11 (SHP2)
Type:
Protein phosphatase
Mol. Mass.:
68443.59
Organism:
Homo sapiens (Human)
Description:
Q06124
Residue:
597
  
Inhibitor
Name:
BDBM88800
Synonyms:
4-acetyl-N-[3-(1-tetrazolyl)phenyl]benzenesulfonamide 4-ethanoyl-N-[3-(1,2,3,4-tetrazol-1-yl)phenyl]benzenesulfonamide SMR000651739 | cid_7693352
Type:
Small organic molecule
Emp. Form.:
C15H13N5O3S
Mol. Mass.:
343.36
SMILES:
CC(=O)c1ccc(cc1)S(=O)(=O)Nc1cccc(c1)-n1cnnn1
: