Target
Tyrosine-protein phosphatase non-receptor type 11
Ligand
BDBM83060
Substrate
Meas. Tech.
Dose Response selectivity of inhibitors of Striatal-Enriched Phosphatase (STEP) in a SHP2 (PTPN11) Inhibition Assay
IC50
3420±n/a nM
Citation
 PubChem, PC Dose Response selectivity of inhibitors of Striatal-Enriched Phosphatase (STEP) in a SHP2 (PTPN11) Inhibition Assay PubChem Bioassay (2012)[AID] 
Target
Name:
Tyrosine-protein phosphatase non-receptor type 11
Synonyms:
3.1.3.48 PTP-1D PTP2C Protein Tyrosine Phosphatase PPN11/Shp2 Protein-Tyrosine Phosphatase SHP-2 Protein-tyrosine phosphatase 2C SH-PTP3 SHP2 Src homology phosphatase 2 (SHP-2) Tyrosine-protein phosphatase non-receptor type 11 (SHP-2) | Tyrosine-protein phosphatase non-receptor type 11 (SHP2)
Type:
Protein phosphatase
Mol. Mass.:
68443.59
Organism:
Homo sapiens (Human)
Description:
Q06124
Residue:
593
  
Inhibitor
Name:
BDBM83060
Synonyms:
MLS001076797 N-[[5-(2-chloranyl-4-nitro-phenyl)furan-2-yl]methylideneamino]-5-methyl-1H-pyrazole-3-carboxamide N-[[5-(2-chloro-4-nitrophenyl)-2-furanyl]methylideneamino]-5-methyl-1H-pyrazole-3-carboxamide SMR000646583 | cid_1940545
Type:
Small organic molecule
Emp. Form.:
C16H12ClN5O4
Mol. Mass.:
373.751
SMILES:
Cc1cc([nH]n1)C(=O)NN=Cc1ccc(o1)-c1ccc(cc1Cl)[N+]([O-])=O
: