Target
26S proteasome non-ATPase regulatory subunit 14
Ligand
BDBM88869
Substrate
Meas. Tech.
Dose response confirmation of uHTS RPN11 inhibitor hits in a Fluorescence Polarization assay
IC50
1410±359 nM
Citation
 PubChem, PC Dose response confirmation of uHTS RPN11 inhibitor hits in a Fluorescence Polarization assay PubChem Bioassay (2012)[AID] 
Target
Name:
26S proteasome non-ATPase regulatory subunit 14
Synonyms:
26S Proteasome regulatory subunit Rpn11 (Rpn11) PSDE_HUMAN PSMD14 protein
Type:
Protein
Mol. Mass.:
34576.68
Organism:
Homo sapiens (Human)
Description:
O00487
Residue:
310
  
Inhibitor
Name:
BDBM88869
Synonyms:
2-N,4-N-bis[(E)-(3-methoxyphenyl)methylideneamino]-3,5-dimethyl-1H-pyrrole-2,4-dicarboxamide N'~2~,N'~4~-bis[(1E)-(3-methoxyphenyl)methylene]-3,5-dimethyl-1H-pyrrole-2,4-dicarbohydrazide N2,N4-bis[(E)-(3-methoxyphenyl)methylideneamino]-3,5-dimethyl-1H-pyrrole-2,4-dicarboxamide cid_20846841
Type:
Small organic molecule
Emp. Form.:
C24H25N5O4
Mol. Mass.:
447.4864
SMILES:
COc1cccc(\C=N\NC(=O)c2[nH]c(C)c(C(=O)N\N=C\c3cccc(OC)c3)c2C)c1
: