Target
26S proteasome non-ATPase regulatory subunit 14
Ligand
BDBM48876
Substrate
Meas. Tech.
Dose response confirmation of uHTS RPN11 inhibitor hits in a Fluorescence Polarization assay
IC50
5820±745 nM
Citation
 PubChem, PC Dose response confirmation of uHTS RPN11 inhibitor hits in a Fluorescence Polarization assay PubChem Bioassay (2012)[AID] 
Target
Name:
26S proteasome non-ATPase regulatory subunit 14
Synonyms:
26S Proteasome regulatory subunit Rpn11 (Rpn11) PSDE_HUMAN PSMD14 protein
Type:
Protein
Mol. Mass.:
34576.68
Organism:
Homo sapiens (Human)
Description:
O00487
Residue:
310
  
Inhibitor
Name:
BDBM48876
Synonyms:
3-[5-[(Z)-(5-azanylidene-7-oxidanylidene-3-phenyl-[1,3]thiazolo[3,2-a]pyrimidin-6-ylidene)methyl]furan-2-yl]benzoic acid 3-[5-[(Z)-(5-imino-7-oxo-3-phenyl-6-thiazolo[3,2-a]pyrimidinylidene)methyl]-2-furanyl]benzoic acid 3-{5-[(Z)-(5-imino-7-oxo-3-phenyl-5H-[1,3]thiazolo[3,2-a]pyrimidin-6(7H)-ylidene)methyl]-2-furyl}benzoic acid SMR000312940 | cid_16195500
Type:
Small organic molecule
Emp. Form.:
C24H15N3O4S
Mol. Mass.:
441.459
SMILES:
OC(=O)c1cccc(c1)-c1ccc(\C=C2/C(=O)N=C3SC=C(N3C2=N)c2ccccc2)o1
: