Target
Prothrombin
Ligand
BDBM46141
Substrate
Meas. Tech.
Dose Response validation of uHTS RPN11 inhibitor hits using a Thrombin Fluorescence Polarization assay
IC50
59100±29800 nM
Citation
 PubChem, PC Dose Response validation of uHTS RPN11 inhibitor hits using a Thrombin Fluorescence Polarization assay PubChem Bioassay (2012)[AID] 
Target
Name:
Prothrombin
Synonyms:
Activation peptide fragment 1 Coagulation factor II Prothrombin Thrombin Thrombin light chain
Type:
Enzyme
Mol. Mass.:
70502.73
Organism:
Bos taurus (Bovine)
Description:
P00735
Residue:
625
  
Inhibitor
Name:
BDBM46141
Synonyms:
1-(2-furanylmethyl)-1,3-diazinane-2,4,6-trione 1-(furan-2-ylmethyl)-1,3-diazinane-2,4,6-trione cid_2269367
Type:
Small organic molecule
Emp. Form.:
C9H8N2O4
Mol. Mass.:
208.1708
SMILES:
O=C1CC(=O)N(Cc2ccco2)C(=O)N1
: