Target
Prothrombin
Ligand
BDBM88987
Substrate
Meas. Tech.
Dose Response validation of uHTS RPN11 inhibitor hits using a Thrombin Fluorescence Polarization assay
IC50
14300±1180 nM
Citation
 PubChem, PC Dose Response validation of uHTS RPN11 inhibitor hits using a Thrombin Fluorescence Polarization assay PubChem Bioassay (2012)[AID] 
Target
Name:
Prothrombin
Synonyms:
Activation peptide fragment 1 Coagulation factor II Prothrombin Thrombin Thrombin light chain
Type:
Enzyme
Mol. Mass.:
70502.73
Organism:
Bos taurus (Bovine)
Description:
P00735
Residue:
625
  
Inhibitor
Name:
BDBM88987
Synonyms:
(2S)-1-[2-[(2Z)-2-(2,4-dimethoxybenzylidene)-3-keto-coumaran-6-yl]oxyacetyl]proline (2S)-1-[2-[[(2Z)-2-[(2,4-dimethoxyphenyl)methylidene]-3-oxo-1-benzofuran-6-yl]oxy]acetyl]pyrrolidine-2-carboxylic acid MLS001157771 cid_16403955
Type:
Small organic molecule
Emp. Form.:
C24H23NO8
Mol. Mass.:
453.4413
SMILES:
COc1ccc(\C=C2/Oc3cc(OCC(=O)N4CCC[C@H]4C(O)=O)ccc3C2=O)c(OC)c1
: