Target
Prothrombin
Ligand
BDBM89034
Substrate
Meas. Tech.
Dose Response validation of uHTS RPN11 inhibitor hits using a Thrombin Fluorescence Polarization assay
IC50
62800±4480 nM
Citation
 PubChem, PC Dose Response validation of uHTS RPN11 inhibitor hits using a Thrombin Fluorescence Polarization assay PubChem Bioassay (2012)[AID] 
Target
Name:
Prothrombin
Synonyms:
Activation peptide fragment 1 Coagulation factor II Prothrombin Thrombin Thrombin light chain
Type:
Enzyme
Mol. Mass.:
70502.73
Organism:
Bos taurus (Bovine)
Description:
P00735
Residue:
625
  
Inhibitor
Name:
BDBM89034
Synonyms:
(1,2-dimethyl-3-imidazo[1,2-a]pyridin-4-iumyl)-diphenyl-sulfanylidenephosphorane;methyl sulfate (1,2-dimethylimidazo[1,2-a]pyridin-4-ium-3-yl)-diphenyl-thioxo-phosphorane;methyl sulfate MLS002703110 cid_56643192
Type:
Small organic molecule
Emp. Form.:
C21H20N2PS
Mol. Mass.:
363.435
SMILES:
Cc1c([n+]2ccccc2n1C)P(=S)(c1ccccc1)c1ccccc1
: