Target
Tyrosine-protein phosphatase non-receptor type 5
Ligand
BDBM88757
Substrate
Meas. Tech.
Dose response confirmation of uHTS small molecule inhibitors of Striatal-Enriched Phosphatase via a fluorescence intensity assay
IC50
11200±n/a nM
Citation
 PubChem, PC Dose response confirmation of uHTS small molecule inhibitors of Striatal-Enriched Phosphatase via a fluorescence intensity assay PubChem Bioassay (2012)[AID] 
Target
Name:
Tyrosine-protein phosphatase non-receptor type 5
Synonyms:
PTN5_HUMAN Tyrosine-protein phosphatase non-receptor type 5 | Tyrosine-protein phosphatase non-receptor type 5 isoform a
Type:
Enzyme Catalytic Domain
Mol. Mass.:
63510.68
Organism:
Homo sapiens (Human)
Description:
gi_90652859
Residue:
565
  
Inhibitor
Name:
BDBM88757
Synonyms:
1-(3-chloranyl-4-methoxy-phenyl)-3-[2-(4-methylpiperidin-1-yl)ethyl]thiourea 1-(3-chloro-4-methoxyphenyl)-3-[2-(4-methyl-1-piperidinyl)ethyl]thiourea MLS000664868 SMR000294826 | cid_972870
Type:
Small organic molecule
Emp. Form.:
C16H24ClN3OS
Mol. Mass.:
341.899
SMILES:
COc1ccc(NC(=S)NCCN2CCC(C)CC2)cc1Cl
: