Target
Tyrosine-protein phosphatase non-receptor type 5
Ligand
BDBM88780
Substrate
Meas. Tech.
Dose response confirmation of uHTS small molecule inhibitors of Striatal-Enriched Phosphatase via a fluorescence intensity assay
IC50
>80000±n/a nM
Citation
 PubChem, PC Dose response confirmation of uHTS small molecule inhibitors of Striatal-Enriched Phosphatase via a fluorescence intensity assay PubChem Bioassay (2012)[AID] 
Target
Name:
Tyrosine-protein phosphatase non-receptor type 5
Synonyms:
PTN5_HUMAN Tyrosine-protein phosphatase non-receptor type 5 | Tyrosine-protein phosphatase non-receptor type 5 isoform a
Type:
Enzyme Catalytic Domain
Mol. Mass.:
63510.68
Organism:
Homo sapiens (Human)
Description:
gi_90652859
Residue:
565
  
Inhibitor
Name:
BDBM88780
Synonyms:
MLS001163614 N-(3-chloro-4-methoxy-phenyl)-4-keto-chromene-2-carboxamide N-(3-chloro-4-methoxyphenyl)-4-oxo-4H-chromene-2-carboxamide SMR000497432 | cid_887096
Type:
Small organic molecule
Emp. Form.:
C17H12ClNO4
Mol. Mass.:
329.734
SMILES:
COc1ccc(NC(=O)c2cc(=O)c3ccccc3o2)cc1Cl
: