Target
Tyrosine-protein phosphatase non-receptor type 5
Ligand
BDBM88793
Substrate
Meas. Tech.
Dose response confirmation of uHTS small molecule inhibitors of Striatal-Enriched Phosphatase via a fluorescence intensity assay
IC50
11700±n/a nM
Citation
 PubChem, PC Dose response confirmation of uHTS small molecule inhibitors of Striatal-Enriched Phosphatase via a fluorescence intensity assay PubChem Bioassay (2012)[AID] 
Target
Name:
Tyrosine-protein phosphatase non-receptor type 5
Synonyms:
PTN5_HUMAN Tyrosine-protein phosphatase non-receptor type 5 | Tyrosine-protein phosphatase non-receptor type 5 isoform a
Type:
Enzyme Catalytic Domain
Mol. Mass.:
63510.68
Organism:
Homo sapiens (Human)
Description:
gi_90652859
Residue:
565
  
Inhibitor
Name:
BDBM88793
Synonyms:
4-(2-Oxo-pyrrolidin-1-yl)-benzoic acid (3-bromo-benzylidene)-hydrazide N-[(E)-(3-bromobenzylidene)amino]-4-(2-ketopyrrolidino)benzamide N-[(E)-(3-bromophenyl)methylideneamino]-4-(2-oxo-1-pyrrolidinyl)benzamide SMR000607708 | cid_5338192
Type:
Small organic molecule
Emp. Form.:
C18H16BrN3O2
Mol. Mass.:
386.243
SMILES:
Brc1cccc(\C=N\NC(=O)c2ccc(cc2)N2CCCC2=O)c1
: