Target
Dual specificity protein phosphatase 3
Ligand
BDBM34219
Substrate
Meas. Tech.
Dose Response selectivity of inhibitors of STriatal-Enriched Phosphatase (STEP) in the dual-specificity protein-tyrosine phosphatase VHR Inhibition Assay
IC50
570±n/a nM
Citation
 PubChem, PC Dose Response selectivity of inhibitors of STriatal-Enriched Phosphatase (STEP) in the dual-specificity protein-tyrosine phosphatase VHR Inhibition Assay PubChem Bioassay (2012)[AID] 
Target
Name:
Dual specificity protein phosphatase 3
Synonyms:
DUS3_HUMAN Dual specificity protein phosphatase (VHR) Dual specificity protein phosphatase VHR Tyrosine-protein phosphatase non-receptor type 1 | VHR
Type:
Hydrolase
Mol. Mass.:
20480.58
Organism:
Homo sapiens (Human)
Description:
Residue:
185
  
Inhibitor
Name:
BDBM34219
Synonyms:
3-Methyl-7-(3-phenyl-propyl)-8-(2-piperidin-1-yl-ethylsulfanyl)-3,7-dihydro-purine-2,6-dione 3-methyl-7-(3-phenylpropyl)-8-(2-piperidinoethylthio)xanthine MLS000032263 cid_652142
Type:
Small organic molecule
Emp. Form.:
C22H29N5O2S
Mol. Mass.:
427.563
SMILES:
Cn1c2nc(SCCN3CCCCC3)n(CCCc3ccccc3)c2c(=O)[nH]c1=O
: