Target
Dual specificity protein phosphatase 3
Ligand
BDBM47086
Substrate
Meas. Tech.
Dose Response selectivity of inhibitors of STriatal-Enriched Phosphatase (STEP) in the dual-specificity protein-tyrosine phosphatase VHR Inhibition Assay
IC50
1210±n/a nM
Citation
 PubChem, PC Dose Response selectivity of inhibitors of STriatal-Enriched Phosphatase (STEP) in the dual-specificity protein-tyrosine phosphatase VHR Inhibition Assay PubChem Bioassay (2012)[AID] 
Target
Name:
Dual specificity protein phosphatase 3
Synonyms:
DUS3_HUMAN Dual specificity protein phosphatase (VHR) Dual specificity protein phosphatase VHR Tyrosine-protein phosphatase non-receptor type 1 | VHR
Type:
Hydrolase
Mol. Mass.:
20480.58
Organism:
Homo sapiens (Human)
Description:
Residue:
185
  
Inhibitor
Name:
BDBM47086
Synonyms:
2-(3-methylanilino)-[1,3,4]thiadiazolo[2,3-b]quinazolin-5-one 2-[(3-methylphenyl)amino]-5H-[1,3,4]thiadiazolo[2,3-b]quinazolin-5-one MLS000095263 cid_3238944
Type:
Small organic molecule
Emp. Form.:
C16H12N4OS
Mol. Mass.:
308.358
SMILES:
Cc1cccc(Nc2nn3c(nc4ccccc4c3=O)s2)c1
: