Target
Dual specificity protein phosphatase 3
Ligand
BDBM88740
Substrate
Meas. Tech.
Dose Response selectivity of inhibitors of STriatal-Enriched Phosphatase (STEP) in the dual-specificity protein-tyrosine phosphatase VHR Inhibition Assay
IC50
73900±n/a nM
Citation
 PubChem, PC Dose Response selectivity of inhibitors of STriatal-Enriched Phosphatase (STEP) in the dual-specificity protein-tyrosine phosphatase VHR Inhibition Assay PubChem Bioassay (2012)[AID] 
Target
Name:
Dual specificity protein phosphatase 3
Synonyms:
DUS3_HUMAN Dual specificity protein phosphatase (VHR) Dual specificity protein phosphatase VHR Tyrosine-protein phosphatase non-receptor type 1 | VHR
Type:
Hydrolase
Mol. Mass.:
20480.58
Organism:
Homo sapiens (Human)
Description:
Residue:
185
  
Inhibitor
Name:
BDBM88740
Synonyms:
1-(4-methylbenzyl)-3-(p-tolyl)pyrazole-4-carbaldehyde 3-(4-methylphenyl)-1-[(4-methylphenyl)methyl]pyrazole-4-carbaldehyde SMR000264355 | cid_2063317
Type:
Small organic molecule
Emp. Form.:
C19H18N2O
Mol. Mass.:
290.359
SMILES:
Cc1ccc(Cn2cc(C=O)c(n2)-c2ccc(C)cc2)cc1
: