Target
Mitochondrial import inner membrane translocase subunit TIM23
Ligand
BDBM89078
Substrate
Meas. Tech.
SAR analysis of small molecule inhibitors of tim23-1 yeast via a luminescent assay
IC50
>99000±n/a nM
Citation
 PubChem, PC SAR analysis of small molecule inhibitors of tim23-1 yeast via a luminescent assay PubChem Bioassay (2012)[AID] 
Target
Name:
Mitochondrial import inner membrane translocase subunit TIM23
Synonyms:
MAS6 MPI3 TIM23_YEAST | TPA: Essential component of the Translocase of the Inner Mitochondrial membrane (TIM23 complex)
Type:
Enzyme Catalytic Domain
Mol. Mass.:
23245.32
Organism:
Saccharomyces cerevisiae S288c
Description:
gi_285814664
Residue:
222
  
Inhibitor
Name:
BDBM89078
Synonyms:
MLS-0463349.0001 N-(5-chloro-2-methoxy-phenyl)-5-keto-3,7-dimethyl-thiazolo[3,2-a]pyrimidine-6-sulfonamide N-(5-chloro-2-methoxyphenyl)-3,7-dimethyl-5-oxo-[1,3]thiazolo[3,2-a]pyrimidine-6-sulfonamide | cid_8087994
Type:
Small organic molecule
Emp. Form.:
C15H14ClN3O4S2
Mol. Mass.:
399.872
SMILES:
COc1ccc(Cl)cc1NS(=O)(=O)c1c(C)nc2scc(C)n2c1=O
: