Target
Mitochondrial import inner membrane translocase subunit TIM23
Ligand
BDBM89111
Substrate
Meas. Tech.
SAR analysis of small molecule inhibitors of tim23-1 yeast via a luminescent assay
IC50
>99000±n/a nM
Citation
 PubChem, PC SAR analysis of small molecule inhibitors of tim23-1 yeast via a luminescent assay PubChem Bioassay (2012)[AID] 
Target
Name:
Mitochondrial import inner membrane translocase subunit TIM23
Synonyms:
MAS6 MPI3 TIM23_YEAST | TPA: Essential component of the Translocase of the Inner Mitochondrial membrane (TIM23 complex)
Type:
Enzyme Catalytic Domain
Mol. Mass.:
23245.32
Organism:
Saccharomyces cerevisiae S288c
Description:
gi_285814664
Residue:
222
  
Inhibitor
Name:
BDBM89111
Synonyms:
MLS-0463378.0001 N-(6-amino-1-benzyl-2,4-dioxopyrimidin-5-yl)-N-methyl-3-methylsulfonylbenzamide N-[6-azanyl-2,4-bis(oxidanylidene)-1-(phenylmethyl)pyrimidin-5-yl]-N-methyl-3-methylsulfonyl-benzamide | cid_16294517
Type:
Small organic molecule
Emp. Form.:
C20H20N4O5S
Mol. Mass.:
428.462
SMILES:
CN(C(=O)c1cccc(c1)S(C)(=O)=O)c1c(N)n(Cc2ccccc2)c(=O)[nH]c1=O
: