Target
High affinity choline transporter 1
Ligand
BDBM89161
Substrate
Meas. Tech.
Dose responses of compounds that activate the Choline Transporter (CHT) - 10 point CRC
EC50
17540±n/a nM
Citation
 PubChem, PC Dose responses of compounds that activate the Choline Transporter (CHT) - 10 point CRC PubChem Bioassay (2012)[AID] 
Target
Name:
High affinity choline transporter 1
Synonyms:
CHT1 SC5A7_HUMAN high affinity choline transporter 1
Type:
PROTEIN
Mol. Mass.:
63194.33
Organism:
Homo sapiens (Human)
Description:
ChEMBL_1464247
Residue:
580
  
Inhibitor
Name:
BDBM89161
Synonyms:
6,7-dimethoxy-N-propan-2-yl-1-thiophen-2-yl-3,4-dihydro-1H-isoquinoline-2-carbothioamide N-isopropyl-6,7-dimethoxy-1-(2-thienyl)-3,4-dihydro-1H-isoquinoline-2-carbothioamide cid_4969301
Type:
Small organic molecule
Emp. Form.:
C19H24N2O2S2
Mol. Mass.:
376.536
SMILES:
COc1cc2CCN(C(c3cccs3)c2cc1OC)C(=S)NC(C)C
: