Target
Mitochondrial import inner membrane translocase subunit TIM10
Ligand
BDBM89080
Substrate
Meas. Tech.
SAR analysis of small molecule inhibitors of tim23-1: a luminescent tim10-1 yeast counterscreen.
IC50
81330±n/a nM
Citation
 PubChem, PC SAR analysis of small molecule inhibitors of tim23-1: a luminescent tim10-1 yeast counterscreen. PubChem Bioassay (2012)[AID] 
Target
Name:
Mitochondrial import inner membrane translocase subunit TIM10
Synonyms:
MRS11 TIM10_YEAST TPA: Essential protein of the mitochondrial intermembrane space, forms a complex with Tim9p (TIM10 complex) that delivers hydrophobic proteins to the TIM22 complex for insertion into the inner ...
Type:
Enzyme Catalytic Domain
Mol. Mass.:
10303.50
Organism:
Saccharomyces cerevisiae S288c
Description:
gi_285809906
Residue:
93
  
Inhibitor
Name:
BDBM89080
Synonyms:
MLS-0463351.0001 N-(2,3-dihydro-1,4-benzodioxin-6-yl)-3,7-dimethyl-5-oxo-6-thiazolo[3,2-a]pyrimidinesulfonamide N-(2,3-dihydro-1,4-benzodioxin-6-yl)-5-keto-3,7-dimethyl-thiazolo[3,2-a]pyrimidine-6-sulfonamide | cid_8083593
Type:
Small organic molecule
Emp. Form.:
C16H15N3O5S2
Mol. Mass.:
393.437
SMILES:
Cc1csc2nc(C)c(c(=O)n12)S(=O)(=O)Nc1ccc2OCCOc2c1
: