Target
Mitochondrial import inner membrane translocase subunit TIM10
Ligand
BDBM89105
Substrate
Meas. Tech.
SAR analysis of small molecule inhibitors of tim23-1: a luminescent tim10-1 yeast counterscreen.
IC50
77850±n/a nM
Citation
 PubChem, PC SAR analysis of small molecule inhibitors of tim23-1: a luminescent tim10-1 yeast counterscreen. PubChem Bioassay (2012)[AID] 
Target
Name:
Mitochondrial import inner membrane translocase subunit TIM10
Synonyms:
MRS11 TIM10_YEAST TPA: Essential protein of the mitochondrial intermembrane space, forms a complex with Tim9p (TIM10 complex) that delivers hydrophobic proteins to the TIM22 complex for insertion into the inner ...
Type:
Enzyme Catalytic Domain
Mol. Mass.:
10303.50
Organism:
Saccharomyces cerevisiae S288c
Description:
gi_285809906
Residue:
93
  
Inhibitor
Name:
BDBM89105
Synonyms:
2-[(7-bromanyl-4-oxidanylidene-pyrido[1,2-a]pyrimidin-2-yl)methylsulfanyl]pyridine-3-carboxylic acid 2-[(7-bromo-4-oxo-2-pyrido[1,2-a]pyrimidinyl)methylthio]-3-pyridinecarboxylic acid MLS-0463372.0001 | cid_8003341
Type:
Small organic molecule
Emp. Form.:
C15H10BrN3O3S
Mol. Mass.:
392.227
SMILES:
OC(=O)c1cccnc1SCc1cc(=O)n2cc(Br)ccc2n1
: