Target
Mitochondrial import inner membrane translocase subunit TIM10
Ligand
BDBM89110
Substrate
Meas. Tech.
SAR analysis of small molecule inhibitors of tim23-1: a luminescent tim10-1 yeast counterscreen.
IC50
74790±n/a nM
Citation
 PubChem, PC SAR analysis of small molecule inhibitors of tim23-1: a luminescent tim10-1 yeast counterscreen. PubChem Bioassay (2012)[AID] 
Target
Name:
Mitochondrial import inner membrane translocase subunit TIM10
Synonyms:
MRS11 TIM10_YEAST TPA: Essential protein of the mitochondrial intermembrane space, forms a complex with Tim9p (TIM10 complex) that delivers hydrophobic proteins to the TIM22 complex for insertion into the inner ...
Type:
Enzyme Catalytic Domain
Mol. Mass.:
10303.50
Organism:
Saccharomyces cerevisiae S288c
Description:
gi_285809906
Residue:
93
  
Inhibitor
Name:
BDBM89110
Synonyms:
2-[(5-methyl-2-pyridinyl)sulfonylmethyl]-4-pyrido[1,2-a]pyrimidinone 2-[(5-methylpyridin-2-yl)sulfonylmethyl]pyrido[1,2-a]pyrimidin-4-one cid_47051838
Type:
Small organic molecule
Emp. Form.:
C15H13N3O3S
Mol. Mass.:
315.347
SMILES:
Cc1ccc(nc1)S(=O)(=O)Cc1cc(=O)n2ccccc2n1
: