Target
Mitochondrial import inner membrane translocase subunit TIM10
Ligand
BDBM89124
Substrate
Meas. Tech.
SAR analysis of small molecule inhibitors of tim23-1: a luminescent tim10-1 yeast counterscreen.
IC50
>99000±n/a nM
Citation
 PubChem, PC SAR analysis of small molecule inhibitors of tim23-1: a luminescent tim10-1 yeast counterscreen. PubChem Bioassay (2012)[AID] 
Target
Name:
Mitochondrial import inner membrane translocase subunit TIM10
Synonyms:
MRS11 TIM10_YEAST TPA: Essential protein of the mitochondrial intermembrane space, forms a complex with Tim9p (TIM10 complex) that delivers hydrophobic proteins to the TIM22 complex for insertion into the inner ...
Type:
Enzyme Catalytic Domain
Mol. Mass.:
10303.50
Organism:
Saccharomyces cerevisiae S288c
Description:
gi_285809906
Residue:
93
  
Inhibitor
Name:
BDBM89124
Synonyms:
6-acetyl-2,3,4,9-tetrahydrocarbazol-1-one MLS-0463403.0001 | cid_708520
Type:
Small organic molecule
Emp. Form.:
C14H13NO2
Mol. Mass.:
227.2585
SMILES:
CC(=O)c1ccc2[nH]c3c(CCCC3=O)c2c1
: