Target
Mitochondrial import inner membrane translocase subunit TIM10
Ligand
BDBM89083
Substrate
Meas. Tech.
SAR analysis of small molecule inhibitors of tim23-1: a luminescent TIM10 yeast counterscreen.
IC50
81640±n/a nM
Citation
 PubChem, PC SAR analysis of small molecule inhibitors of tim23-1: a luminescent TIM10 yeast counterscreen. PubChem Bioassay (2012)[AID] 
Target
Name:
Mitochondrial import inner membrane translocase subunit TIM10
Synonyms:
MRS11 TIM10_YEAST TPA: Essential protein of the mitochondrial intermembrane space, forms a complex with Tim9p (TIM10 complex) that delivers hydrophobic proteins to the TIM22 complex for insertion into the inner ...
Type:
Enzyme Catalytic Domain
Mol. Mass.:
10303.50
Organism:
Saccharomyces cerevisiae S288c
Description:
gi_285809906
Residue:
93
  
Inhibitor
Name:
BDBM89083
Synonyms:
MLS-0463354.0001 N-(3-hydroxyphenyl)-3,7-dimethyl-5-oxo-6-thiazolo[3,2-a]pyrimidinesulfonamide N-(3-hydroxyphenyl)-5-keto-3,7-dimethyl-thiazolo[3,2-a]pyrimidine-6-sulfonamide | cid_15990025
Type:
Small organic molecule
Emp. Form.:
C14H13N3O4S2
Mol. Mass.:
351.401
SMILES:
Cc1csc2nc(C)c(c(=O)n12)S(=O)(=O)Nc1cccc(O)c1
: