Target
Mitochondrial import inner membrane translocase subunit TIM10
Ligand
BDBM89115
Substrate
Meas. Tech.
SAR analysis of small molecule inhibitors of tim23-1: a luminescent TIM10 yeast counterscreen.
IC50
>99000±n/a nM
Citation
 PubChem, PC SAR analysis of small molecule inhibitors of tim23-1: a luminescent TIM10 yeast counterscreen. PubChem Bioassay (2012)[AID] 
Target
Name:
Mitochondrial import inner membrane translocase subunit TIM10
Synonyms:
MRS11 TIM10_YEAST TPA: Essential protein of the mitochondrial intermembrane space, forms a complex with Tim9p (TIM10 complex) that delivers hydrophobic proteins to the TIM22 complex for insertion into the inner ...
Type:
Enzyme Catalytic Domain
Mol. Mass.:
10303.50
Organism:
Saccharomyces cerevisiae S288c
Description:
gi_285809906
Residue:
93
  
Inhibitor
Name:
BDBM89115
Synonyms:
3,5-dimethyl-N-[4-(4-methylphenyl)-6-phenyl-2-pyridinyl]-4-isoxazolecarboxamide 3,5-dimethyl-N-[4-(4-methylphenyl)-6-phenylpyridin-2-yl]-1,2-oxazole-4-carboxamide MLS-0463382.0001 | cid_45843959
Type:
Small organic molecule
Emp. Form.:
C24H21N3O2
Mol. Mass.:
383.4424
SMILES:
Cc1noc(C)c1C(=O)Nc1cc(cc(n1)-c1ccccc1)-c1ccc(C)cc1
: