Target
Mitochondrial import inner membrane translocase subunit TIM10
Ligand
BDBM89134
Substrate
Meas. Tech.
SAR analysis of small molecule inhibitors of tim23-1: a luminescent TIM10 yeast counterscreen.
IC50
>99000±n/a nM
Citation
 PubChem, PC SAR analysis of small molecule inhibitors of tim23-1: a luminescent TIM10 yeast counterscreen. PubChem Bioassay (2012)[AID] 
Target
Name:
Mitochondrial import inner membrane translocase subunit TIM10
Synonyms:
MRS11 TIM10_YEAST TPA: Essential protein of the mitochondrial intermembrane space, forms a complex with Tim9p (TIM10 complex) that delivers hydrophobic proteins to the TIM22 complex for insertion into the inner ...
Type:
Enzyme Catalytic Domain
Mol. Mass.:
10303.50
Organism:
Saccharomyces cerevisiae S288c
Description:
gi_285809906
Residue:
93
  
Inhibitor
Name:
BDBM89134
Synonyms:
MLS-0463412.0001 N-[4-(2,3-dihydroimidazo[2,1-b]thiazol-6-yl)phenyl]-3-pyridinesulfonamide cid_7488336
Type:
Small organic molecule
Emp. Form.:
C16H14N4O2S2
Mol. Mass.:
358.438
SMILES:
O=S(=O)(Nc1ccc(cc1)-c1cn2CCSc2n1)c1cccnc1
: