Target
DNA (cytosine-5)-methyltransferase 1
Ligand
BDBM44426
Substrate
Meas. Tech.
Dose response confirmation of DNMT1 inhibitors in a Fluorescent Molecular Beacon assay
IC50
4470±96 nM
Citation
 PubChem, PC Dose response confirmation of DNMT1 inhibitors in a Fluorescent Molecular Beacon assay PubChem Bioassay (2012)[AID] 
Target
Name:
DNA (cytosine-5)-methyltransferase 1
Synonyms:
AIM CXXC9 DNA (cytosine-5)-methyltransferase 1 isoform b DNA methyltransferase HsaI DNMT1 M.HsaI | MCMT
Type:
Enzyme
Mol. Mass.:
183184.85
Organism:
Homo sapiens (Human)
Description:
P26358
Residue:
1616
  
Inhibitor
Name:
BDBM44426
Synonyms:
MLS000027789 N-[5-(4-Methoxy-benzyl)-[1,3,4]thiadiazol-2-yl]-2-thiophen-2-yl-acetamide N-[5-[(4-methoxyphenyl)methyl]-1,3,4-thiadiazol-2-yl]-2-thiophen-2-ylacetamide cid_648470
Type:
Small organic molecule
Emp. Form.:
C16H15N3O2S2
Mol. Mass.:
345.439
SMILES:
COc1ccc(Cc2nnc(NC(=O)Cc3cccs3)s2)cc1
: