Target
DNA (cytosine-5)-methyltransferase 1
Ligand
BDBM46141
Substrate
Meas. Tech.
Dose response confirmation of DNMT1 inhibitors in a Fluorescent Molecular Beacon assay
IC50
1580±68 nM
Citation
 PubChem, PC Dose response confirmation of DNMT1 inhibitors in a Fluorescent Molecular Beacon assay PubChem Bioassay (2012)[AID] 
Target
Name:
DNA (cytosine-5)-methyltransferase 1
Synonyms:
AIM CXXC9 DNA (cytosine-5)-methyltransferase 1 isoform b DNA methyltransferase HsaI DNMT1 M.HsaI | MCMT
Type:
Enzyme
Mol. Mass.:
183184.85
Organism:
Homo sapiens (Human)
Description:
P26358
Residue:
1616
  
Inhibitor
Name:
BDBM46141
Synonyms:
1-(2-furanylmethyl)-1,3-diazinane-2,4,6-trione 1-(furan-2-ylmethyl)-1,3-diazinane-2,4,6-trione cid_2269367
Type:
Small organic molecule
Emp. Form.:
C9H8N2O4
Mol. Mass.:
208.1708
SMILES:
O=C1CC(=O)N(Cc2ccco2)C(=O)N1
: