Target
DNA (cytosine-5)-methyltransferase 1
Ligand
BDBM52754
Substrate
Meas. Tech.
Dose response confirmation of DNMT1 inhibitors in a Fluorescent Molecular Beacon assay
IC50
3200±211 nM
Citation
 PubChem, PC Dose response confirmation of DNMT1 inhibitors in a Fluorescent Molecular Beacon assay PubChem Bioassay (2012)[AID] 
Target
Name:
DNA (cytosine-5)-methyltransferase 1
Synonyms:
AIM CXXC9 DNA (cytosine-5)-methyltransferase 1 isoform b DNA methyltransferase HsaI DNMT1 M.HsaI | MCMT
Type:
Enzyme
Mol. Mass.:
183184.85
Organism:
Homo sapiens (Human)
Description:
P26358
Residue:
1616
  
Inhibitor
Name:
BDBM52754
Synonyms:
3-amino-4-hydroxy-5-nitro-besylic acid 3-azanyl-5-nitro-4-oxidanyl-benzenesulfonic acid SMR000371835 | cid_3844407
Type:
Small organic molecule
Emp. Form.:
C6H6N2O6S
Mol. Mass.:
234.187
SMILES:
Nc1cc(cc(c1O)[N+]([O-])=O)S(O)(=O)=O
: