Target
Zinc finger protein GLI1
Ligand
BDBM89263
Substrate
Meas. Tech.
Dose response confirmation of uHTS antagonist hits from Gli-SUFU in a luminescent reporter assay
IC50
663±n/a nM
Citation
 PubChem, PC Dose response confirmation of uHTS antagonist hits from Gli-SUFU in a luminescent reporter assay PubChem Bioassay (2012)[AID] 
Target
Name:
Zinc finger protein GLI1
Synonyms:
GLI1_MOUSE Gli1 | Glioma-associated oncogene homolog
Type:
PROTEIN
Mol. Mass.:
118579.34
Organism:
Mus musculus
Description:
EBI_101259
Residue:
1111
  
Inhibitor
Name:
BDBM89263
Synonyms:
(5E)-5-[(2,5-dimethyl-1-pyridin-3-yl-pyrrol-3-yl)methylidene]-3-(4-nitrophenyl)-2-sulfanylidene-1,3-thiazolidin-4-one (5E)-5-[[2,5-dimethyl-1-(3-pyridinyl)-3-pyrrolyl]methylidene]-3-(4-nitrophenyl)-2-sulfanylidene-4-thiazolidinone 5-{[2,5-dimethyl-1-(3-pyridinyl)-1H-pyrrol-3-yl]methylene}-3-(4-nitrophenyl)-2-thioxo-1,3-thiazolidin-4-one SMR000196555 | cid_5734258
Type:
Small organic molecule
Emp. Form.:
C21H16N4O3S2
Mol. Mass.:
436.507
SMILES:
Cc1cc(\C=C2\SC(=S)N(C2=O)c2ccc(cc2)[N+]([O-])=O)c(C)n1-c1cccnc1
: