Target
Interleukin-1 receptor-associated kinase 4
Ligand
BDBM278722
Substrate
Meas. Tech.
IRAK4 Kinase Assay
pH
7.2±n/a
IC50
1.000±n/a nM
Comments
extracted
Citation
 Lim, JAltman, MDBrubaker, JDGibeau, CR Pyrrolopyridazine inhibitors of IRAK4 activity US Patent  US10040798 Publication Date 8/7/2018 
Target
Name:
Interleukin-1 receptor-associated kinase 4
Synonyms:
IRAK-4 IRAK4_HUMAN Interleukin-1 receptor-associated kinase 4 (IRAK4) | Renal carcinoma antigen NY-REN-64
Type:
Protein
Mol. Mass.:
51519.08
Organism:
Homo sapiens (Human)
Description:
Q9NWZ3
Residue:
460
  
Inhibitor
Name:
BDBM278722
Synonyms:
2-{[(1R,2S)-2- aminocyclo- hexyl]amino}-N-[3- (difluoromethyl)-1- methyl-1H-pyrazol-4- yl]pyrrolo[1,2- b]pyridazine-7- carboxamide trifluoroacetate | US10040798, Example 19
Type:
Small organic molecule
Emp. Form.:
C21H24F5N7O3
Mol. Mass.:
517.4524
SMILES:
OC(=O)C(F)(F)F.Cn1cc(NC(=O)c2ccc3ccc(N[C@@H]4CCCC[C@@H]4N)nn23)c(n1)C(F)F
: