Target
Interleukin-1 receptor-associated kinase 4
Ligand
BDBM278796
Substrate
Meas. Tech.
IRAK4 Kinase Assay
pH
7.2±n/a
IC50
5626±n/a nM
Comments
extracted
Citation
 Lim, JAltman, MDBrubaker, JDGibeau, CR Pyrrolopyridazine inhibitors of IRAK4 activity US Patent  US10040798 Publication Date 8/7/2018 
Target
Name:
Interleukin-1 receptor-associated kinase 4
Synonyms:
IRAK-4 IRAK4_HUMAN Interleukin-1 receptor-associated kinase 4 (IRAK4) | Renal carcinoma antigen NY-REN-64
Type:
Protein
Mol. Mass.:
51519.08
Organism:
Homo sapiens (Human)
Description:
Q9NWZ3
Residue:
460
  
Inhibitor
Name:
BDBM278796
Synonyms:
2-{[(1R,2R)-2-amino- 3,3-difluoro- cyclohexyl]amino}- N-(2- bromophenyl)pyrrolo[1,2- b]pyridazine-7- carboxamide trifluoroacetate | US10040798, Example 94
Type:
Small organic molecule
Emp. Form.:
C22H21BrF5N5O3
Mol. Mass.:
578.33
SMILES:
OC(=O)C(F)(F)F.N[C@@H]1[C@@H](CCCC1(F)F)Nc1ccc2ccc(C(=O)Nc3ccccc3Br)n2n1
: