Target
Corticotropin-releasing factor-binding protein
Ligand
BDBM89681
Substrate
Meas. Tech.
Dose Response confirmation of uHTS hits for small molecule agonists of the CRF-binding protein and CRF-R2 receptor complex
EC50
>53000±n/a nM
Citation
 PubChem, PC Dose Response confirmation of uHTS hits for small molecule agonists of the CRF-binding protein and CRF-R2 receptor complex PubChem Bioassay (2012)[AID] 
Target
Name:
Corticotropin-releasing factor-binding protein
Synonyms:
CRFBP CRHBP_HUMAN | corticotropin releasing factor-binding protein
Type:
Enzyme Catalytic Domain
Mol. Mass.:
36143.95
Organism:
Homo sapiens (Human)
Description:
P24387
Residue:
322
  
Inhibitor
Name:
BDBM89681
Synonyms:
2-(1-oxohex-4-ynyl)-1H-isoquinoline-1-carbonitrile 2-hex-4-ynoyl-1H-isoquinoline-1-carbonitrile SMR000021241 | cid_3243821
Type:
Small organic molecule
Emp. Form.:
C16H14N2O
Mol. Mass.:
250.2952
SMILES:
CC#CCCC(=O)N1C=Cc2ccccc2C1C#N
: