Target
ATP-binding cassette sub-family B member 6
Ligand
BDBM58598
Substrate
Meas. Tech.
Dose Response of Flow Cytometric HTS Screen for inhibitors of the ABC transporter ABCB6 for Cherry Pick01
EC50
44230±n/a nM
Citation
 PubChem, PC Dose Response of Flow Cytometric HTS Screen for inhibitors of the ABC transporter ABCB6 for Cherry Pick01 PubChem Bioassay (2012)[AID] 
Target
Name:
ATP-binding cassette sub-family B member 6
Synonyms:
ABCB6 ATP-binding cassette sub-family B member 6, mitochondrial PRP | UMAT
Type:
Enzyme Catalytic Domain
Mol. Mass.:
93896.51
Organism:
Homo sapiens (Human)
Description:
gi_9955963
Residue:
842
  
Inhibitor
Name:
BDBM58598
Synonyms:
4-[[5-chloro-2-(3-methylbenzyl)sulfonyl-pyrimidine-4-carbonyl]amino]benzoic acid methyl ester MLS001116149 cid_16452489 methyl 4-[[5-chloro-2-[(3-methylphenyl)methylsulfonyl]pyrimidine-4-carbonyl]amino]benzoate
Type:
Small organic molecule
Emp. Form.:
C21H18ClN3O5S
Mol. Mass.:
459.903
SMILES:
COC(=O)c1ccc(NC(=O)c2nc(ncc2Cl)S(=O)(=O)Cc2cccc(C)c2)cc1
: