Target
Mitochondrial peptide methionine sulfoxide reductase
Ligand
BDBM72272
Substrate
Meas. Tech.
Absorbance-based biochemical high throughput dose response assay for activators of Methionine sulfoxide reductase A (MsrA)
EC50
>103951±n/a nM
Citation
 PubChem, PC Absorbance-based biochemical high throughput dose response assay for activators of Methionine sulfoxide reductase A (MsrA) PubChem Bioassay (2012)[AID] 
Target
Name:
Mitochondrial peptide methionine sulfoxide reductase
Synonyms:
MSRA MSRA_BOVIN
Type:
Enzyme Catalytic Domain
Mol. Mass.:
25822.90
Organism:
Bos taurus
Description:
gi_73586699
Residue:
233
  
Inhibitor
Name:
BDBM72272
Synonyms:
1-[(5-nitro-2-thiophenyl)methylideneamino]-2-benzimidazolamine MLS000580841 SMR000220254 [1-[(E)-(5-nitro-2-thienyl)methyleneamino]benzimidazol-2-yl]amine | cid_936612
Type:
Small organic molecule
Emp. Form.:
C12H9N5O2S
Mol. Mass.:
287.297
SMILES:
Nc1nc2ccccc2n1\N=C\c1ccc(s1)[N+]([O-])=O
: