Target
Mitochondrial peptide methionine sulfoxide reductase
Ligand
BDBM60966
Substrate
Meas. Tech.
Absorbance-based biochemical high throughput dose response assay for activators of Methionine sulfoxide reductase A (MsrA)
EC50
>103758±n/a nM
Citation
 PubChem, PC Absorbance-based biochemical high throughput dose response assay for activators of Methionine sulfoxide reductase A (MsrA) PubChem Bioassay (2012)[AID] 
Target
Name:
Mitochondrial peptide methionine sulfoxide reductase
Synonyms:
MSRA MSRA_BOVIN
Type:
Enzyme Catalytic Domain
Mol. Mass.:
25822.90
Organism:
Bos taurus
Description:
gi_73586699
Residue:
233
  
Inhibitor
Name:
BDBM60966
Synonyms:
2-[(2-amino-5-methylsulfonylphenyl)disulfanyl]-4-methylsulfonylaniline MLS001242699 [2-[(2-amino-5-mesyl-phenyl)disulfanyl]-4-mesyl-phenyl]amine | cid_3789162
Type:
Small organic molecule
Emp. Form.:
C14H16N2O4S4
Mol. Mass.:
404.548
SMILES:
CS(=O)(=O)c1ccc(N)c(SSc2cc(ccc2N)S(C)(=O)=O)c1
: