Target
Mitochondrial peptide methionine sulfoxide reductase
Ligand
BDBM91507
Substrate
Meas. Tech.
Absorbance-based biochemical high throughput dose response assay for activators of Methionine sulfoxide reductase A (MsrA)
EC50
>103891±n/a nM
Citation
 PubChem, PC Absorbance-based biochemical high throughput dose response assay for activators of Methionine sulfoxide reductase A (MsrA) PubChem Bioassay (2012)[AID] 
Target
Name:
Mitochondrial peptide methionine sulfoxide reductase
Synonyms:
MSRA MSRA_BOVIN
Type:
Enzyme Catalytic Domain
Mol. Mass.:
25822.90
Organism:
Bos taurus
Description:
gi_73586699
Residue:
233
  
Inhibitor
Name:
BDBM91507
Synonyms:
MLS002158756 N-(2-cyanophenyl)-2-[4-(1H-indol-3-ylmethyl)-2,5-diketo-imidazolidin-1-yl]acetamide N-(2-cyanophenyl)-2-[4-(1H-indol-3-ylmethyl)-2,5-dioxoimidazolidin-1-yl]acetamide cid_4037998
Type:
Small organic molecule
Emp. Form.:
C21H17N5O3
Mol. Mass.:
387.3914
SMILES:
O=C(CN1C(=O)NC(Cc2c[nH]c3ccccc23)C1=O)Nc1ccccc1C#N
: