Target
Mitochondrial peptide methionine sulfoxide reductase
Ligand
BDBM91508
Substrate
Meas. Tech.
Absorbance-based biochemical high throughput dose response assay for activators of Methionine sulfoxide reductase A (MsrA)
EC50
>104034±n/a nM
Citation
 PubChem, PC Absorbance-based biochemical high throughput dose response assay for activators of Methionine sulfoxide reductase A (MsrA) PubChem Bioassay (2012)[AID] 
Target
Name:
Mitochondrial peptide methionine sulfoxide reductase
Synonyms:
MSRA MSRA_BOVIN
Type:
Enzyme Catalytic Domain
Mol. Mass.:
25822.90
Organism:
Bos taurus
Description:
gi_73586699
Residue:
233
  
Inhibitor
Name:
BDBM91508
Synonyms:
2-chloranyl-3-(furan-2-ylmethylamino)naphthalene-1,4-dione 2-chloro-3-(2-furfurylamino)-1,4-naphthoquinone MLS002608685 cid_239677
Type:
Small organic molecule
Emp. Form.:
C15H10ClNO3
Mol. Mass.:
287.698
SMILES:
Oc1c(Cl)c(N=Cc2ccco2)c(O)c2ccccc12
: