Target
Drug resistance protein 2
Ligand
BDBM91522
Substrate
Meas. Tech.
Dose Response HTS singleplex for inhibitors of yeast efflux pump, specifically Cdr2 with Cherry Pick2 compound set
EC50
72630±n/a nM
Citation
 PubChem, PC Dose Response HTS singleplex for inhibitors of yeast efflux pump, specifically Cdr2 with Cherry Pick2 compound set PubChem Bioassay (2012)[AID] 
Target
Name:
Drug resistance protein 2
Synonyms:
Type:
Enzyme Catalytic Domain
Mol. Mass.:
169004.09
Organism:
Candida albicans
Description:
Q19S54
Residue:
1499
  
Inhibitor
Name:
BDBM91522
Synonyms:
MLS000621984 N-[2-(1-cyclohexenyl)ethyl]-4-[[(2-sulfanylidene-1H-quinazolin-4-yl)amino]methyl]-1-cyclohexanecarboxamide N-[2-(cyclohexen-1-yl)ethyl]-4-[[(2-thioxo-1H-quinazolin-4-yl)amino]methyl]cyclohexanecarboxamide cid_4112671
Type:
Small organic molecule
Emp. Form.:
C24H32N4OS
Mol. Mass.:
424.602
SMILES:
O=C(NCCC1=CCCCC1)C1CCC(CNc2[nH]c(=S)nc3ccccc23)CC1
: