Target
Serine protease 1
Ligand
BDBM113060
Substrate
Meas. Tech.
Trypsin Assay
pH
7.2±n/a
Temperature
310.15±n/a K
Ki
>10000±n/a nM
Comments
extracted
Citation
 Wagberg, FLeonardsson, G Benzoxazinone derivatives for treatment of skin diseases US Patent  US9695194 Publication Date 7/4/2017 
Target
Name:
Serine protease 1
Synonyms:
Alpha-trypsin chain 1 Beta-trypsin PRSS1 TRP1 TRY1_HUMAN Thrombin & trypsin Trypsin I | Trypsin-1
Type:
Enzyme
Mol. Mass.:
26557.80
Organism:
Homo sapiens (Human)
Description:
P07477
Residue:
247
  
Inhibitor
Name:
BDBM113060
Synonyms:
US9695194, 1
Type:
Small organic molecule
Emp. Form.:
C18H17NO4S
Mol. Mass.:
343.397
SMILES:
CCOc1cc2c(cc1OC)nc(oc2=O)-c1ccccc1SC
: