Target
Kallikrein-5 [D153N]
Ligand
BDBM113067
Substrate
Meas. Tech.
KLK5 Assay
pH
8±n/a
Temperature
310.15±n/a K
Ki
600±n/a nM
Comments
extracted
Citation
 Wagberg, FLeonardsson, G Benzoxazinone derivatives for treatment of skin diseases US Patent  US9695194 Publication Date 7/4/2017 
Target
Name:
Kallikrein-5 [D153N]
Synonyms:
KLK-L2 KLK5_HUMAN Kallikrein-5 SCTE | Stratum corneum tryptic enzyme
Type:
PROTEIN
Mol. Mass.:
32031.75
Organism:
Homo sapiens (Human)
Description:
ChEMBL_1282456
Residue:
293
  
Inhibitor
Name:
BDBM113067
Synonyms:
US9695194, 3
Type:
Small organic molecule
Emp. Form.:
C19H19NO6
Mol. Mass.:
357.3573
SMILES:
CCOc1cc2c(cc1OC)nc(oc2=O)-c1ccc(OC)cc1OC
: